"PDXFinder Id",Datasource,"Source Id","Patient Age","Patient Gender","Patient Ethnicity","Patient Treatment History","Patient Original Diagnosis","NCIT Mapped Ontology Term","Origin Tissue","Sample Site","Origin Sample Extraction Method",Classification,"Tumor Type","Cancer Systems","Other Available Data",Mutations,Drugs,Responses
102842,TRACE,PAC0018PR,70-79,Male,"Not specified",,"Poorly differentiated pancreatic ductal adenocarcinoma","Pancreatic Poorly Differentiated Ductal Adenocarcinoma",pancreas,pancreas,,,primary,"Digestive System Cancer","Patient Treatment",,,
106988,LIH,T384,50-59,Female,"Not Specified",,"brain glioblastoma","Brain Glioblastoma",brain,brain,,,primary,"Nervous System Cancer",,,,
96641,IRCC-CRC,CRC0682PR,60-69,Male,"Not Specified",,"Colorectal Carcinoma","Colorectal Carcinoma","Sigmoid Colon","Sigmoid Colon",,,Primary,"Digestive System Cancer","Copy Number Alteration;Gene Mutation",,,
105336,VHIO-CRC,M017,50-59,Female,"Not Specified",,"Rectal adenocarcinoma","Rectal Adenocarcinoma",Rectum,Liver,,,metastatic,"Digestive System Cancer",,,,
101698,IRCC-GC,GTR0353PR,80-89,Male,caucasian,,"Gastroesophageal Junction Adenocarcinoma","Gastroesophageal Junction Adenocarcinoma","Gastroesophageal Junction","Gastroesophageal Junction",,,primary,"Digestive System Cancer","Copy Number Alteration;Gene Mutation",,,
105843,UMCG,UMCGOVPDX36,80-89,female,"Not Specified",,"high grade serous ovarian cancer","High Grade Ovarian Serous Adenocarcinoma",ovary,"intraperitoneal cavity",,,Metastatic,"Reproductive System Cancer",,,,
97295,IRCC-CRC,CRC1138LM,40-49,Female,"Not Specified",,"Colorectal Carcinoma","Colorectal Carcinoma","Right Colon",Liver,,,Metastatic,"Digestive System Cancer","Dosing Studies",,,
99318,IRCC-CRC,CRC0451LM,50-59,Female,"Not Specified",,"Colorectal Carcinoma","Colorectal Carcinoma","Sigmoid Colon",Liver,,,Metastatic,"Digestive System Cancer","Gene Mutation",,,
97753,IRCC-CRC,CRC1486PR,50-59,Male,"Not Specified",,"Colorectal Carcinoma","Colorectal Carcinoma","Right Colon","Right Colon",,,Primary,"Digestive System Cancer",,,,
100606,IRCC-CRC,CRC0071PR,60-69,Male,"Not Specified",,"Colorectal Carcinoma","Colorectal Carcinoma",Caecum,Caecum,,,Primary,"Digestive System Cancer","Gene Mutation",,,
106846,LIH,T832,50-59,Female,"Not Specified",,"brain glioblastoma","Brain Glioblastoma",brain,brain,,,primary,"Nervous System Cancer",,,,
98915,IRCC-CRC,CRC0221LM,50-59,Male,"Not Specified",,"Colorectal Carcinoma","Colorectal Carcinoma","Left Colon",Liver,,,Metastatic,"Digestive System Cancer","Expression;Gene Mutation",,,
105167,VHIO-CRC,T077,60-69,Female,"Not Specified",,"Colon Mucinous Adenocarcinoma","Colon Mucinous Adenocarcinoma","Right Colon",Colon,,,primary,"Digestive System Cancer",,,,
98696,IRCC-CRC,CRC0486LM,70-79,Female,"Not Specified",,"Colorectal Carcinoma","Colorectal Carcinoma","Hepatic Flexure of Colon",Liver,,,Metastatic,"Digestive System Cancer","Copy Number Alteration;Gene Mutation",,,
104664,UOM-BC,BB3RC31,60-69,Female,"Not Specified",,"intraductal breast neoplasm","Invasive Breast Carcinoma of No Special Type",breast,"pleural effusion",,,metastatic,"Breast Cancer","Patient Treatment;Expression;Gene Mutation;Cytogenetics",,,
96542,IRCC-CRC,CRC0098LM,40-49,Male,"Not Specified",,"Colorectal Carcinoma","Colorectal Carcinoma",Rectum,Liver,,,Metastatic,"Digestive System Cancer","Copy Number Alteration;Expression;Gene Mutation;Dosing Studies",,,
100384,IRCC-CRC,CRC0357LM,40-49,Female,"Not Specified",,"Colorectal Carcinoma","Colorectal Carcinoma",Colon,Liver,,,Metastatic,"Digestive System Cancer","Copy Number Alteration;Gene Mutation",,,
106263,VHIO-PC,VHIO_PC-PDX-92,,Male,"Not Specified",,"Pancreatic carcinoma ","Pancreatic Carcinoma",pancreas,liver,,,Metastatic,"Digestive System Cancer",,,,
95000,IRCC-CRC,CRC1161PR,80-89,Male,"Not Specified",,"Colorectal Carcinoma","Colorectal Carcinoma","Hepatic Flexure of Colon","Hepatic Flexure of Colon",,,Primary,"Digestive System Cancer","Copy Number Alteration;Gene Mutation",,,
94540,IRCC-CRC,CRC1185PR,70-79,Male,"Not Specified",,"Colorectal Carcinoma","Colorectal Carcinoma","Splenic Flexure of Colon","Splenic Flexure of Colon",,,Primary,"Digestive System Cancer","Copy Number Alteration;Gene Mutation",,,
95025,IRCC-CRC,CRC0056LM,60-69,Male,"Not Specified",,"Colorectal Carcinoma","Colorectal Carcinoma",Rectum,Liver,,,Metastatic,"Digestive System Cancer","Copy Number Alteration;Expression;Gene Mutation;Dosing Studies",,,
102656,TRACE,BRC0020LY,30-39,Female,"Not specified",,"Invasive Ductal Carcinoma Not Otherwise Specified","Invasive Breast Carcinoma of No Special Type",breast,"axillary lymph node",,,metastatic,"Breast Cancer","Patient Treatment;Cytogenetics",,,
98583,IRCC-CRC,CRC0377LM,70-79,Male,"Not Specified",,"Colorectal Carcinoma","Colorectal Carcinoma","Right Colon",Liver,,,Metastatic,"Digestive System Cancer","Expression;Gene Mutation",,,
99984,IRCC-CRC,CRC1275PR,70-79,Female,"Not Specified",,"Colorectal Carcinoma","Colorectal Carcinoma","Sigmoid Colon","Sigmoid Colon",,,Primary,"Digestive System Cancer","Gene Mutation",,,
99949,IRCC-CRC,CRC1318LM,70-79,Male,"Not Specified",,"Colorectal Carcinoma","Colorectal Carcinoma","Right Colon",Liver,,,Metastatic,"Digestive System Cancer","Gene Mutation",,,
98850,IRCC-CRC,CRC0019LM,80-89,Male,"Not Specified",,"Colorectal Carcinoma","Colorectal Carcinoma","Right Colon",Liver,,,Metastatic,"Digestive System Cancer","Copy Number Alteration;Expression;Gene Mutation;Dosing Studies",,,
105321,VHIO-CRC,T125,70-79,Male,"Not Specified",,"Colon adenocarcinoma","Colon Adenocarcinoma","Sigmoid Flexure",Colon,,,primary,"Digestive System Cancer",,,,
106728,LIH,T226,60-69,Male,"Not Specified",,"brain glioblastoma","Brain Glioblastoma",brain,brain,,,primary,"Nervous System Cancer","Patient Treatment",,,
99044,IRCC-CRC,CRC1389LM,60-69,Male,"Not Specified",,"Colorectal Carcinoma","Colorectal Carcinoma","Left Colon",Liver,,,Metastatic,"Digestive System Cancer","Dosing Studies",,,
100160,IRCC-CRC,CRC0708LM,70-79,Female,"Not Specified",,"Colorectal Carcinoma","Colorectal Carcinoma","Transverse Colon",Liver,,,Metastatic,"Digestive System Cancer","Copy Number Alteration;Gene Mutation",,,
101762,IRCC-GC,GTR0167PR,70-79,Male,caucasian,,"gastric carcinoma","Gastric Carcinoma",stomach,stomach,,,primary,"Digestive System Cancer","Copy Number Alteration;Gene Mutation",,,
102585,TRACE,MEL0029LY,50-59,Female,,,"Cutaneous malignant melanoma","Cutaneous Melanoma",Skin,"Lymph node",,,Metastatic,"Skin Cancer",,,,
106925,LIH,T101,60-69,Male,"Not Specified",,"brain glioblastoma","Brain Glioblastoma",brain,brain,,,primary,"Nervous System Cancer","Copy Number Alteration;Gene Mutation",,,
94908,IRCC-CRC,CRC1326LM,40-49,Female,"Not Specified",,"Colorectal Carcinoma","Colorectal Carcinoma",Rectum,Liver,,,Metastatic,"Digestive System Cancer","Gene Mutation",,,
97529,IRCC-CRC,CRC0714PR,60-69,Male,"Not Specified",,"Colorectal Carcinoma","Colorectal Carcinoma","large intestine",unknown,,,Primary,"Digestive System Cancer","Gene Mutation",,,
105241,VHIO-CRC,T136,80-89,Male,"Not Specified",,"Cecum Adenocarcinoma","Cecum Adenocarcinoma",cecum,Colon,,,primary,"Digestive System Cancer",,,,
97144,IRCC-CRC,CRC1521PR,60-69,Male,"Not Specified",,"Colorectal Carcinoma","Colorectal Carcinoma",Caecum,Caecum,,,Primary,"Digestive System Cancer",,,,
96667,IRCC-CRC,CRC1587LM,"Not Specified",Male,"Not Specified",,"Colorectal Carcinoma","Colorectal Carcinoma","large intestine",Liver,,,Metastatic,"Digestive System Cancer",,,,
95651,IRCC-CRC,CRC1197PR,50-59,Male,"Not Specified",,"Colorectal Carcinoma","Colorectal Carcinoma","Right Colon","Right Colon",,,Primary,"Digestive System Cancer","Copy Number Alteration;Gene Mutation",,,
99912,IRCC-CRC,CRC0740LM,60-69,Female,"Not Specified",,"Colorectal Carcinoma","Colorectal Carcinoma","Right Colon",Liver,,,Metastatic,"Digestive System Cancer","Copy Number Alteration;Gene Mutation",,,
103789,UOC-BC,REV085,60-69,Female,"Not Specified",,"breast carcinoma","Breast Carcinoma",breast,breast,,,primary,"Breast Cancer",Cytogenetics,,,
103811,UOC-BC,PAR1059M,60-69,Female,"Not Specified",,"metastatic breast carcinoma","Breast Carcinoma",breast,skin,,,metastastic,"Breast Cancer",Cytogenetics,,,
106372,VHIO-PC,VHIO_PC-PDX-62,,Male,"Not Specified",,Cholangiocarcinoma,Cholangiocarcinoma,"bile duct",liver,,,Metastatic,"Digestive System Cancer",,,,
104984,VHIO-BC,VHIO_BC580,"Not Specified",Female,"Not Specified",,"breast carcinoma","Breast Carcinoma",breast,"lymph node",,,metastatic,"Breast Cancer",Cytogenetics,,,
99699,IRCC-CRC,CRC1176PR,80-89,Female,"Not Specified",,"Colorectal Carcinoma","Colorectal Carcinoma","Sigmoid Colon","Sigmoid Colon",,,Primary,"Digestive System Cancer","Copy Number Alteration;Gene Mutation",,,
96948,IRCC-CRC,CRC0309LM,50-59,Female,"Not Specified",,"Colorectal Carcinoma","Colorectal Carcinoma",Rectum,Liver,,,Metastatic,"Digestive System Cancer","Copy Number Alteration;Expression;Gene Mutation;Dosing Studies",,,
96772,IRCC-CRC,CRC1171PR,70-79,Female,"Not Specified",,"Colorectal Carcinoma","Colorectal Carcinoma","Splenic Flexure of Colon","Splenic Flexure of Colon",,,Primary,"Digestive System Cancer","Copy Number Alteration;Gene Mutation",,,
103905,UOC-BC,AB040M,60-69,Female,"Not Specified",,"metastatic breast carcinoma","Breast Carcinoma",breast,liver,,,metastastic,"Breast Cancer","Patient Treatment;Cytogenetics",,,
96033,IRCC-CRC,CRC1137LM,60-69,Male,"Not Specified",,"Colorectal Carcinoma","Colorectal Carcinoma","Hepatic Flexure of Colon",Liver,,,Metastatic,"Digestive System Cancer","Copy Number Alteration;Gene Mutation",,,
97918,IRCC-CRC,CRC0552LM,70-79,Female,"Not Specified",,"Colorectal Carcinoma","Colorectal Carcinoma","Sigmoid Colon",Liver,,,Metastatic,"Digestive System Cancer","Copy Number Alteration;Gene Mutation",,,
98254,IRCC-CRC,CRC0257LM,60-69,Female,"Not Specified",,"Colorectal Carcinoma","Colorectal Carcinoma",Rectum,Liver,,,Metastatic,"Digestive System Cancer","Copy Number Alteration;Expression;Gene Mutation;Dosing Studies",,,
94895,IRCC-CRC,CRC0219LM,70-79,Male,"Not Specified",,"Colorectal Carcinoma","Colorectal Carcinoma","Sigmoid Colon",Liver,,,Metastatic,"Digestive System Cancer","Copy Number Alteration;Expression;Gene Mutation;Dosing Studies",,,
96105,IRCC-CRC,CRC0277LM,70-79,Female,"Not Specified",,"Colorectal Carcinoma","Colorectal Carcinoma",Rectum,Liver,,,Metastatic,"Digestive System Cancer","Expression;Gene Mutation;Dosing Studies",,,
99362,IRCC-CRC,CRC0145LM,50-59,Male,"Not Specified",,"Colorectal Carcinoma","Colorectal Carcinoma","Sigmoid Colon",Liver,,,Metastatic,"Digestive System Cancer","Copy Number Alteration;Expression;Gene Mutation;Dosing Studies",,,
94871,IRCC-CRC,CRC0712PR,60-69,Female,"Not Specified",,"Colorectal Carcinoma","Colorectal Carcinoma","Sigmoid Colon","Sigmoid Colon",,,Primary,"Digestive System Cancer","Copy Number Alteration;Gene Mutation",,,
105281,VHIO-CRC,CTAX018,60-69,Male,"Not Specified",,"colorectal Cancer","Colorectal Cancer",colorectal,Liver,,,metastatic,"Digestive System Cancer",,,,
100528,IRCC-CRC,CRC1241LM,60-69,Female,"Not Specified",,"Colorectal Carcinoma","Colorectal Carcinoma",Anus,Liver,,,Metastatic,"Digestive System Cancer","Copy Number Alteration;Gene Mutation;Dosing Studies",,,
105450,VHIO-CRC,T122,50-59,Male,"Not Specified",,"Colon adenocarcinoma","Colon Adenocarcinoma","Sigmoid Flexure",Colon,,,primary,"Digestive System Cancer",,,,
100578,IRCC-CRC,CRC1264LM,70-79,Male,"Not Specified",,"Colorectal Carcinoma","Colorectal Carcinoma","Sigmoid Colon",Liver,,,Metastatic,"Digestive System Cancer","Copy Number Alteration;Gene Mutation;Dosing Studies",,,
106834,LIH,T515,40-49,Male,"Not Specified",,"anaplastic oligodendroglioma","Anaplastic Oligodendroglioma Not Otherwise Specified",brain,brain,,,primary,"Nervous System Cancer",Cytogenetics,,,
95575,IRCC-CRC,CRC1317PR,60-69,Male,"Not Specified",,"Colorectal Carcinoma","Colorectal Carcinoma","Sigmoid Colon","Sigmoid Colon",,,Primary,"Digestive System Cancer","Gene Mutation",,,
100301,IRCC-CRC,CRC0180LM,60-69,Female,"Not Specified",,"Colorectal Carcinoma","Colorectal Carcinoma","Left Colon",Liver,,,Metastatic,"Digestive System Cancer","Copy Number Alteration;Gene Mutation;Dosing Studies",,,
100661,IRCC-CRC,CRC0137LM,70-79,Female,"Not Specified",,"Colorectal Carcinoma","Colorectal Carcinoma","Sigmoid Colon",Liver,,,Metastatic,"Digestive System Cancer","Copy Number Alteration;Expression;Gene Mutation;Dosing Studies",,,
99921,IRCC-CRC,CRC0112LM,50-59,Male,"Not Specified",,"Colorectal Carcinoma","Colorectal Carcinoma","Sigmoid Colon",Liver,,,Metastatic,"Digestive System Cancer","Copy Number Alteration;Expression;Gene Mutation;Dosing Studies",,,
106333,VHIO-PC,VHIO_PC-PDX-38,,Male,"Not Specified",,Cholangiocarcinoma,Cholangiocarcinoma,"bile duct",liver,,,Metastatic,"Digestive System Cancer",,,,
94496,IRCC-CRC,CRC1709LM,"Not Specified",Male,"Not Specified",,"Colorectal Carcinoma","Colorectal Carcinoma","large intestine",Liver,,,Metastatic,"Digestive System Cancer",,,,
98485,IRCC-CRC,CRC0718LM,50-59,Male,"Not Specified",,"Colorectal Carcinoma","Colorectal Carcinoma",Rectum,Liver,,,Metastatic,"Digestive System Cancer","Copy Number Alteration;Gene Mutation;Dosing Studies",,,
106740,LIH,T744,60-69,Male,"Not Specified",,"brain glioblastoma","Brain Glioblastoma",brain,brain,,,primary,"Nervous System Cancer",,,,
94457,IRCC-CRC,CRC0480LM,60-69,"Not Specified","Not Specified",,"Colorectal Carcinoma","Colorectal Carcinoma","Sigmoid Colon",Liver,,,Metastatic,"Digestive System Cancer","Copy Number Alteration;Expression;Gene Mutation;Dosing Studies",,,
94676,IRCC-CRC,CRC0186LM,50-59,Female,"Not Specified",,"Colorectal Carcinoma","Colorectal Carcinoma","Sigmoid Colon",Liver,,,Metastatic,"Digestive System Cancer","Expression;Gene Mutation;Dosing Studies",,,
96248,IRCC-CRC,CRC1334PR,60-69,Male,"Not Specified",,"Colorectal Carcinoma","Colorectal Carcinoma","Sigmoid Colon","Sigmoid Colon",,,Primary,"Digestive System Cancer",,,,
100393,IRCC-CRC,CRC0334LM,60-69,Female,"Not Specified",,"Colorectal Carcinoma","Colorectal Carcinoma",Rectum,Liver,,,Metastatic,"Digestive System Cancer","Copy Number Alteration;Expression;Gene Mutation;Dosing Studies",,,
96940,IRCC-CRC,CRC0482LM,70-79,Male,"Not Specified",,"Colorectal Carcinoma","Colorectal Carcinoma",Rectum,Liver,,,Metastatic,"Digestive System Cancer","Copy Number Alteration;Gene Mutation",,,
95911,IRCC-CRC,CRC1492PR,50-59,Male,"Not Specified",,"Colorectal Carcinoma","Colorectal Carcinoma","Sigmoid Colon","Sigmoid Colon",,,Primary,"Digestive System Cancer",,,,
106415,VHIO-PC,VHIO_PC-PDX-85,,Female,"Not Specified",,Cholangiocarcinoma,Cholangiocarcinoma,"bile duct",liver,,,Metastatic,"Digestive System Cancer",,,,
100134,IRCC-CRC,CRC1240LM,50-59,Female,"Not Specified",,"Colorectal Carcinoma","Colorectal Carcinoma","Sigmoid Colon",Liver,,,Metastatic,"Digestive System Cancer","Copy Number Alteration;Gene Mutation",,,
98404,IRCC-CRC,CRC1605LM,50-59,Male,"Not Specified",,"Colorectal Carcinoma","Colorectal Carcinoma","Hepatic Flexure of Colon",Liver,,,Metastatic,"Digestive System Cancer","Dosing Studies",,,
99661,IRCC-CRC,CRC0666PR,70-79,Male,"Not Specified",,"Colorectal Carcinoma","Colorectal Carcinoma",Rectum,Rectum,,,Primary,"Digestive System Cancer","Copy Number Alteration;Gene Mutation",,,
99207,IRCC-CRC,CRC0572LM,50-59,Male,"Not Specified",,"Colorectal Carcinoma","Colorectal Carcinoma","large intestine",Liver,,,Metastatic,"Digestive System Cancer","Copy Number Alteration;Gene Mutation",,,
99089,IRCC-CRC,CRC0234PR,50-59,Female,"Not Specified",,"Colorectal Carcinoma","Colorectal Carcinoma","Splenic Flexure of Colon","Splenic Flexure of Colon",,,Primary,"Digestive System Cancer","Copy Number Alteration;Gene Mutation",,,
96365,IRCC-CRC,CRC0065PR,40-49,Male,"Not Specified",,"Colorectal Carcinoma","Colorectal Carcinoma",Rectum,Rectum,,,Primary,"Digestive System Cancer","Gene Mutation",,,
94814,IRCC-CRC,CRC1072LM,60-69,Male,"Not Specified",,"Colorectal Carcinoma","Colorectal Carcinoma","large intestine",Liver,,,Metastatic,"Digestive System Cancer","Copy Number Alteration;Gene Mutation;Dosing Studies",,,
100059,IRCC-CRC,CRC0337PR,50-59,Male,"Not Specified",,"Colorectal Carcinoma","Colorectal Carcinoma","Right Colon","Right Colon",,,Primary,"Digestive System Cancer","Copy Number Alteration;Gene Mutation",,,
98864,IRCC-CRC,CRC0498LM,70-79,Female,"Not Specified",,"Colorectal Carcinoma","Colorectal Carcinoma","Sigmoid Colon",Liver,,,Metastatic,"Digestive System Cancer","Copy Number Alteration;Gene Mutation",,,
99782,IRCC-CRC,CRC0520LM,60-69,Female,"Not Specified",,"Colorectal Carcinoma","Colorectal Carcinoma","Sigmoid Colon",Liver,,,Metastatic,"Digestive System Cancer","Copy Number Alteration;Gene Mutation",,,
96714,IRCC-CRC,CRC0474PR,"Not Specified",Female,"Not Specified",,"Colorectal Carcinoma","Colorectal Carcinoma","large intestine",unknown,,,Primary,"Digestive System Cancer","Copy Number Alteration;Gene Mutation",,,
96399,IRCC-CRC,CRC0505LM,60-69,Male,"Not Specified",,"Colorectal Carcinoma","Colorectal Carcinoma",Rectum,Liver,,,Metastatic,"Digestive System Cancer","Copy Number Alteration;Expression;Gene Mutation;Dosing Studies",,,
97649,IRCC-CRC,CRC0472PR,80-89,Female,"Not Specified",,"Colorectal Carcinoma","Colorectal Carcinoma","Right Colon","Right Colon",,,Primary,"Digestive System Cancer","Copy Number Alteration;Gene Mutation",,,
103692,UOC-BC,PAR1053,20-29,Female,"Not Specified",,"breast carcinoma","Breast Carcinoma",breast,breast,,,primary,"Breast Cancer",Cytogenetics,,,
95624,IRCC-CRC,CRC0490LM,40-49,Female,"Not Specified",,"Colorectal Carcinoma","Colorectal Carcinoma",Rectum,Liver,,,Metastatic,"Digestive System Cancer","Copy Number Alteration;Expression;Gene Mutation;Dosing Studies",,,
95475,IRCC-CRC,CRC0327LM,60-69,Male,"Not Specified",,"Colorectal Carcinoma","Colorectal Carcinoma","Sigmoid Colon",Liver,,,Metastatic,"Digestive System Cancer","Copy Number Alteration;Expression;Gene Mutation;Dosing Studies",,,
101943,IRCC-GC,GTR0060PR,70-79,Female,caucasian,,"gastric carcinoma","Gastric Carcinoma",stomach,stomach,,,primary,"Digestive System Cancer","Copy Number Alteration;Gene Mutation",,,
102901,TRACE,MEL0052CM,60-69,Female,,,"Cutaneous malignant melanoma","Cutaneous Melanoma",Skin,Skin,,,Metastatic,"Skin Cancer",,,,
105376,VHIO-CRC,CTAX022,40-49,Female,"Not Specified",,"colorectal Cancer","Colorectal Cancer",colorectal,Liver,,,metastatic,"Digestive System Cancer",,,,
103725,UOC-BC,PAR1045,50-59,Female,"Not Specified",,"breast carcinoma","Breast Carcinoma",breast,breast,,,primary,"Breast Cancer",Cytogenetics,,,
97874,IRCC-CRC,CRC0081LM,60-69,Male,"Not Specified",,"Colorectal Carcinoma","Colorectal Carcinoma","Sigmoid Colon",Liver,,,Metastatic,"Digestive System Cancer","Copy Number Alteration;Expression;Gene Mutation;Dosing Studies",,,
100250,IRCC-CRC,CRC0113LM,50-59,Female,"Not Specified",,"Colorectal Carcinoma","Colorectal Carcinoma","Splenic Flexure of Colon",Liver,,,Metastatic,"Digestive System Cancer","Copy Number Alteration;Expression;Gene Mutation;Dosing Studies",,,
94830,IRCC-CRC,CRC0370LM,50-59,Male,"Not Specified",,"Colorectal Carcinoma","Colorectal Carcinoma",Caecum,Liver,,,Metastatic,"Digestive System Cancer","Expression;Gene Mutation;Dosing Studies",,,
95357,IRCC-CRC,CRC0166LM,60-69,Male,"Not Specified",,"Colorectal Carcinoma","Colorectal Carcinoma","Sigmoid Colon",Liver,,,Metastatic,"Digestive System Cancer","Copy Number Alteration;Expression;Gene Mutation;Dosing Studies",,,
98639,IRCC-CRC,CRC1090LM,70-79,Female,"Not Specified",,"Colorectal Carcinoma","Colorectal Carcinoma","large intestine",Liver,,,Metastatic,"Digestive System Cancer","Copy Number Alteration;Gene Mutation",,,
95151,IRCC-CRC,CRC1490PR,70-79,Male,"Not Specified",,"Colorectal Carcinoma","Colorectal Carcinoma","Right Colon","Right Colon",,,Primary,"Digestive System Cancer",,,,
101843,IRCC-GC,GTR0219PR,60-69,Male,caucasian,,"gastric carcinoma","Gastric Carcinoma",stomach,stomach,,,primary,"Digestive System Cancer","Copy Number Alteration;Gene Mutation",,,
105152,VHIO-CRC,T156,40-49,Male,"Not Specified",,"Colon adenocarcinoma","Colon Adenocarcinoma","Right Colon",Colon,,,primary,"Digestive System Cancer",,,,
102027,IRCC-GC,GTR0249PR,80-89,Female,caucasian,,"gastric carcinoma","Gastric Carcinoma",stomach,stomach,,,primary,"Digestive System Cancer","Copy Number Alteration;Gene Mutation",,,
99672,IRCC-CRC,CRC0687LM,40-49,Female,"Not Specified",,"Colorectal Carcinoma","Colorectal Carcinoma",Caecum,Liver,,,Metastatic,"Digestive System Cancer","Copy Number Alteration;Gene Mutation",,,
97404,IRCC-CRC,CRC0054LM,70-79,Female,"Not Specified",,"Colorectal Carcinoma","Colorectal Carcinoma","Left Colon",Liver,,,Metastatic,"Digestive System Cancer","Copy Number Alteration;Expression;Gene Mutation;Dosing Studies",,,
101720,IRCC-GC,GTR0227PR,70-79,Male,caucasian,,"gastric carcinoma","Gastric Carcinoma",stomach,stomach,,,primary,"Digestive System Cancer","Copy Number Alteration;Gene Mutation",,,
95787,IRCC-CRC,CRC1285PR,70-79,Male,"Not Specified",,"Colorectal Carcinoma","Colorectal Carcinoma","Hepatic Flexure of Colon","Hepatic Flexure of Colon",,,Primary,"Digestive System Cancer","Gene Mutation",,,
98461,IRCC-CRC,CRC0553PR,50-59,Male,"Not Specified",,"Colorectal Carcinoma","Colorectal Carcinoma","Sigmoid Colon","Sigmoid Colon",,,Primary,"Digestive System Cancer","Copy Number Alteration;Gene Mutation",,,
90619,Curie-LC,LCF26,50-59,Male,"Not Specified",,"Large-cell carcinoma","Lung Large Cell Carcinoma",Lung,Lung,,,primary,"Thoracic Cancer","Copy Number Alteration;Gene Mutation;Cytogenetics;Dosing Studies",,,
101957,IRCC-GC,GTR0126PR,70-79,Male,caucasian,,"gastric carcinoma","Gastric Carcinoma",stomach,stomach,,,primary,"Digestive System Cancer","Copy Number Alteration;Gene Mutation",,,
105381,VHIO-CRC,T095,50-59,Female,"Not Specified",,"Colon adenocarcinoma","Colon Adenocarcinoma","Sigmoid Flexure",Colon,,,primary,"Digestive System Cancer",,,,
98267,IRCC-CRC,CRC1628LM,50-59,Male,"Not Specified",,"Colorectal Carcinoma","Colorectal Carcinoma",Caecum,Liver,,,Metastatic,"Digestive System Cancer",,,,
95173,IRCC-CRC,CRC0185LM,50-59,Male,"Not Specified",,"Colorectal Carcinoma","Colorectal Carcinoma","Sigmoid Colon",Liver,,,Metastatic,"Digestive System Cancer","Copy Number Alteration;Expression;Gene Mutation;Dosing Studies",,,
95503,IRCC-CRC,CRC0057LM,50-59,Male,"Not Specified",,"Colorectal Carcinoma","Colorectal Carcinoma","Sigmoid Colon",Liver,,,Metastatic,"Digestive System Cancer","Copy Number Alteration;Expression;Gene Mutation;Dosing Studies",,,
99706,IRCC-CRC,CRC1360LM,50-59,Male,"Not Specified",,"Colorectal Carcinoma","Colorectal Carcinoma","large intestine",Liver,,,Metastatic,"Digestive System Cancer","Dosing Studies",,,
95017,IRCC-CRC,CRC1412LM,60-69,Male,"Not Specified",,"Colorectal Carcinoma","Colorectal Carcinoma","large intestine",Liver,,,Metastatic,"Digestive System Cancer",,,,
96231,IRCC-CRC,CRC0498PR,70-79,Female,"Not Specified",,"Colorectal Carcinoma","Colorectal Carcinoma","Sigmoid Colon","Sigmoid Colon",,,Primary,"Digestive System Cancer","Copy Number Alteration;Gene Mutation",,,
99443,IRCC-CRC,CRC1261LM,"Not Specified",Female,"Not Specified",,"Colorectal Carcinoma","Colorectal Carcinoma","large intestine",Liver,,,Metastatic,"Digestive System Cancer","Copy Number Alteration;Gene Mutation",,,
100085,IRCC-CRC,CRC1529PR,60-69,Male,"Not Specified",,"Colorectal Carcinoma","Colorectal Carcinoma","Hepatic Flexure of Colon","Hepatic Flexure of Colon",,,Primary,"Digestive System Cancer",,,,
106799,LIH,T394,40-49,Female,"Not Specified",,"brain glioblastoma","Brain Glioblastoma",brain,brain,,,primary,"Nervous System Cancer","Copy Number Alteration;Gene Mutation;Cytogenetics",,,
98008,IRCC-CRC,CRC0321LM,30-39,Male,"Not Specified",,"Colorectal Carcinoma","Colorectal Carcinoma",Rectum,Liver,,,Metastatic,"Digestive System Cancer","Copy Number Alteration;Expression;Gene Mutation;Dosing Studies",,,